Target
Gamma-aminobutyric acid receptor subunit alpha-2
Ligand
BDBM352404
Substrate
Meas. Tech.
Binding Assay
Ki
20.3±n/a nM
Citation
 Owen, RMPryde, DCTakeuchi, MWatson, CA Imidazopyridazine derivatives as modulators of the GABAA receptor activity US Patent  US9802945 Publication Date 10/31/2017 
Target
Name:
Gamma-aminobutyric acid receptor subunit alpha-2
Synonyms:
GABA receptor alpha-2 subunit GBRA2_HUMAN | Gamma-aminobutyric acid receptor subunit alpha-2 (GABRA2)
Type:
Protein
Mol. Mass.:
51338.78
Organism:
Homo sapiens (Human)
Description:
P47869
Residue:
451
  
Inhibitor
Name:
BDBM352404
Synonyms:
US9802945, 15
Type:
Small organic molecule
Emp. Form.:
C20H16FN5O
Mol. Mass.:
361.3723
SMILES:
CCn1cnc2c(cnnc12)-c1ccc(F)c(c1)-c1cccc(c1)C(N)=O
: