Target
Gamma-aminobutyric acid receptor subunit alpha-2
Ligand
BDBM352410
Substrate
Meas. Tech.
Binding Assay
Ki
6.30±n/a nM
Citation
 Owen, RMPryde, DCTakeuchi, MWatson, CA Imidazopyridazine derivatives as modulators of the GABAA receptor activity US Patent  US9802945 Publication Date 10/31/2017 
Target
Name:
Gamma-aminobutyric acid receptor subunit alpha-2
Synonyms:
GABA receptor alpha-2 subunit GBRA2_HUMAN | Gamma-aminobutyric acid receptor subunit alpha-2 (GABRA2)
Type:
Protein
Mol. Mass.:
51338.78
Organism:
Homo sapiens (Human)
Description:
P47869
Residue:
451
  
Inhibitor
Name:
BDBM352410
Synonyms:
5′-(7-Ethyl-7H-imidazo[4,5-c]pyridazin-4-yl)-2′-fluoro-2-methoxy-N-methylbiphenyl-4-carboxamide | US9802945, 21
Type:
Small organic molecule
Emp. Form.:
C22H20FN5O2
Mol. Mass.:
405.4249
SMILES:
CCn1cnc2c(cnnc12)-c1ccc(F)c(c1)-c1ccc(cc1CO)C(=O)NC
: