Target
Cathepsin S
Ligand
BDBM352415
Substrate
Meas. Tech.
Enzyme Assay
Ki
110±n/a nM
Citation
 Nardi, ARatcliffe, PCraan, THertrampf, TLesch, BSteinhagen, H 3-oxo-tetrahydro-furo[3,2-b]pyrrol-4(5H)-yl) derivatives II US Patent  US9802947 Publication Date 10/31/2017 
Target
Name:
Cathepsin S
Synonyms:
CATS_HUMAN Cathepsin S (Cat S) | cathepsin S preproprotein
Type:
Protein
Mol. Mass.:
37507.38
Organism:
Homo sapiens (Human)
Description:
P25774
Residue:
331
  
Inhibitor
Name:
BDBM352415
Synonyms:
N—((S)-2-((3aS,6S,6aS)-6-chloro-3-oxotetrahydro-2H-furo[3,2-b]pyrrol-4(5H)-yl)-1-cyclopentyl-2-oxoethyl)-5-(pyrimidin-5-yl)thiophene-2-carboxamide | US9802947, Compound Example 3
Type:
Small organic molecule
Emp. Form.:
C22H23ClN4O4S
Mol. Mass.:
474.96
SMILES:
Cl[C@H]1CN([C@H]2[C@@H]1OCC2=O)C(=O)[C@@H](NC(=O)c1ccc(s1)-c1cncnc1)C1CCCC1
: