Target
Phosphatidylinositol 3-kinase catalytic subunit type 3
Ligand
BDBM337905
Substrate
Meas. Tech.
Enzyme Assay
IC50
<10±n/a nM
Citation
 Bharathan, ITBlackburn, CCiavarri, JPChouitar, JCullis, CAD Amore, NFleming, PEGigstad, KMGipson, KEGirard, MHu, YLee, JLi, GRezaei, MSintchak, MDSoucy, FStroud, SGVos, TJWong, TXu, HXu, TYe, Y Heteroaryls and uses thereof US Patent  US9802960 Publication Date 10/31/2017 
Target
Name:
Phosphatidylinositol 3-kinase catalytic subunit type 3
Synonyms:
BC033004 PIK3C3 Phosphatidylinositol 3-kinase catalytic subunit type 3 (PIK3C3) Phosphoinositide 3-Kinase (PI3K), Vps34 PtdIns-3-kinase type 3 hVPS34
Type:
Enzyme
Mol. Mass.:
101551.30
Organism:
Homo sapiens (Human)
Description:
Recombinant human Vps34 protein was expressed as monomeric GST-fusion and purified.
Residue:
887
  
Inhibitor
Name:
BDBM337905
Synonyms:
US9751854, Compound I-86 | US9802960, Compound I-86
Type:
Small organic molecule
Emp. Form.:
C26H23FN6O4S
Mol. Mass.:
534.562
SMILES:
CC(=O)Nc1cc(ccn1)-c1ccc(c(F)c1)S(=O)(=O)Nc1cc(cnc1C)-c1ccnc(NC(C)=O)c1
: