Target
Phosphatidylinositol 3-kinase catalytic subunit type 3
Ligand
BDBM338233
Substrate
Meas. Tech.
Enzyme Assay
IC50
<10±n/a nM
Citation
 Bharathan, ITBlackburn, CCiavarri, JPChouitar, JCullis, CAD Amore, NFleming, PEGigstad, KMGipson, KEGirard, MHu, YLee, JLi, GRezaei, MSintchak, MDSoucy, FStroud, SGVos, TJWong, TXu, HXu, TYe, Y Heteroaryls and uses thereof US Patent  US9802960 Publication Date 10/31/2017 
Target
Name:
Phosphatidylinositol 3-kinase catalytic subunit type 3
Synonyms:
BC033004 PIK3C3 Phosphatidylinositol 3-kinase catalytic subunit type 3 (PIK3C3) Phosphoinositide 3-Kinase (PI3K), Vps34 PtdIns-3-kinase type 3 hVPS34
Type:
Enzyme
Mol. Mass.:
101551.30
Organism:
Homo sapiens (Human)
Description:
Recombinant human Vps34 protein was expressed as monomeric GST-fusion and purified.
Residue:
887
  
Inhibitor
Name:
BDBM338233
Synonyms:
US9751854, Compound I-417 | US9802960, Compound I-417
Type:
Small organic molecule
Emp. Form.:
C19H16ClFN4O4S
Mol. Mass.:
450.871
SMILES:
COC(=O)Nc1cc(ccn1)-c1cnc(C)c(NS(=O)(=O)c2ccc(Cl)cc2F)c1
: