Target
RAC-beta serine/threonine-protein kinase
Ligand
BDBM16954
Substrate
biotinylated Akt peptide substrate
Meas. Tech.
Akt Kinase Assay
pH
7.5±n/a
Temperature
295.15±n/a K
IC50
5±n/a nM
Citation
 Zhu, GDGong, JClaiborne, AWoods, KWGandhi, VBThomas, SLuo, YLiu, XShi, YGuan, RMagnone, SRKlinghofer, VJohnson, EFBouska, JShoemaker, AOleksijew, AStoll, VSDe Jong, ROltersdorf, TLi, QRosenberg, SHGiranda, VL Isoquinoline-pyridine-based protein kinase B/Akt antagonists: SAR and in vivo antitumor activity. Bioorg Med Chem Lett 16:3150-5 (2006)  
Target
Name:
RAC-beta serine/threonine-protein kinase
Synonyms:
AKT2 PKB beta Protein kinase B (Akt 2) Protein kinase B, beta RAC-alpha serine/threonine-protein kinase (AKT2) RAC-beta serine/threonine-protein kinase (AKT2) Serine/threonine-protein kinase AKT2 | Serine/threonine-protein kinase Rac alpha/beta
Type:
Enzyme
Mol. Mass.:
55766.64
Organism:
Homo sapiens (Human)
Description:
Residue:
481
  
Inhibitor
Name:
BDBM16954
Synonyms:
6-{5-[(2S)-2-amino-3-(1H-indol-3-yl)propoxy]-2-chloropyridin-3-yl}isoquinoline | Isoquinoline-pyridine, 10a
Type:
Small organic molecule
Emp. Form.:
C25H21ClN4O
Mol. Mass.:
428.913
SMILES:
N[C@H](COc1cnc(Cl)c(c1)-c1ccc2cnccc2c1)Cc1c[nH]c2ccccc12
:
Substrate
Name:
biotinylated Akt peptide substrate
Synonyms:
Type:
Biotinylated Peptide
Mol. Mass.:
3178.04
Organism:
Description:
Km=15 uM
Residue:
28