Target
RAC-gamma serine/threonine-protein kinase
Ligand
BDBM16958
Substrate
biotinylated Akt peptide substrate
Meas. Tech.
Akt Kinase Assay
pH
7.5±n/a
Temperature
295.15±n/a K
IC50
39±n/a nM
Citation
 Zhu, GDGong, JClaiborne, AWoods, KWGandhi, VBThomas, SLuo, YLiu, XShi, YGuan, RMagnone, SRKlinghofer, VJohnson, EFBouska, JShoemaker, AOleksijew, AStoll, VSDe Jong, ROltersdorf, TLi, QRosenberg, SHGiranda, VL Isoquinoline-pyridine-based protein kinase B/Akt antagonists: SAR and in vivo antitumor activity. Bioorg Med Chem Lett 16:3150-5 (2006)  
Target
Name:
RAC-gamma serine/threonine-protein kinase
Synonyms:
AKT3 PKB gamma Protein kinase Akt-3 Protein kinase B, gamma RAC-gamma serine/threonine-protein kinase Serine/threonine-protein kinase AKT | Serine/threonine-protein kinase AKT3
Type:
Enzyme
Mol. Mass.:
55769.36
Organism:
Homo sapiens (Human)
Description:
Residue:
479
  
Inhibitor
Name:
BDBM16958
Synonyms:
6-{5-[(2S)-2-amino-3-(1H-indol-3-yl)propoxy]-2-ethynylpyridin-3-yl}isoquinoline | Isoquinoline-pyridine, 10e
Type:
Small organic molecule
Emp. Form.:
C27H22N4O
Mol. Mass.:
418.4898
SMILES:
N[C@H](COc1cnc(C#C)c(c1)-c1ccc2cnccc2c1)Cc1c[nH]c2ccccc12
:
Substrate
Name:
biotinylated Akt peptide substrate
Synonyms:
Type:
Biotinylated Peptide
Mol. Mass.:
3178.04
Organism:
Description:
Km=15 uM
Residue:
28