Target
cAMP-dependent protein kinase catalytic subunit alpha
Ligand
BDBM16958
Substrate
biotinylated kemptide
Meas. Tech.
PKA/PKC Kinase Assay
pH
7.5±n/a
Temperature
295.15±n/a K
IC50
1±n/a nM
Citation
 Zhu, GDGong, JClaiborne, AWoods, KWGandhi, VBThomas, SLuo, YLiu, XShi, YGuan, RMagnone, SRKlinghofer, VJohnson, EFBouska, JShoemaker, AOleksijew, AStoll, VSDe Jong, ROltersdorf, TLi, QRosenberg, SHGiranda, VL Isoquinoline-pyridine-based protein kinase B/Akt antagonists: SAR and in vivo antitumor activity. Bioorg Med Chem Lett 16:3150-5 (2006)  
Target
Name:
cAMP-dependent protein kinase catalytic subunit alpha
Synonyms:
KAPCA_BOVIN PKC Protein Kinase C cAMP-Dependent Protein Kinase (PKA) cAMP-dependent protein kinase A cAMP-dependent protein kinase, alpha-catalytic subunit
Type:
Enzyme Complex
Mol. Mass.:
40627.77
Organism:
Bos taurus (bovine)
Description:
The PKA holoenzyme purified from bovine heart, exists as an inactive tetrameric complex, which consists of a regulatory dimer associated with two catalytic subunits. It requires cAMP to activate the enzymatic reaction.
Residue:
351
  
Inhibitor
Name:
BDBM16958
Synonyms:
6-{5-[(2S)-2-amino-3-(1H-indol-3-yl)propoxy]-2-ethynylpyridin-3-yl}isoquinoline | Isoquinoline-pyridine, 10e
Type:
Small organic molecule
Emp. Form.:
C27H22N4O
Mol. Mass.:
418.4898
SMILES:
N[C@H](COc1cnc(C#C)c(c1)-c1ccc2cnccc2c1)Cc1c[nH]c2ccccc12
:
Substrate
Name:
biotinylated kemptide
Synonyms:
Type:
Biotinylated Peptide
Mol. Mass.:
1353.09
Organism:
Description:
Residue:
12
ITINHLRRASLG