Target
Nuclear receptor ROR-gamma
Ligand
BDBM352612
Substrate
Meas. Tech.
Biological Assay
IC50
3.89±n/a nM
Citation
 Aicher, TDVanHuis, CAThomas, WDMacLean, JKAndresen, BMBarr, KJBienstock, CEAnthony, NJDaniels, MLiu, KLiu, YWhite, CMLapointe, BTSciammetta, NSimov, V Tetrahydronaphthyridine, benzoxazine, aza-benzoxazine and related bicyclic compounds for inhibition of RORgamma activity and the treatment of disease US Patent  US9809561 Publication Date 11/7/2017 
Target
Name:
Nuclear receptor ROR-gamma
Synonyms:
NR1F3 Nuclear receptor ROR-gamma (RORC) RAR-related orphan receptor C (RORc) RORG RZRG Retinoid-related orphan receptor-gamma (RORc)
Type:
Enzyme Catalytic Domain
Mol. Mass.:
58218.40
Organism:
Homo sapiens (Human)
Description:
P51449
Residue:
518
  
Inhibitor
Name:
BDBM352612
Synonyms:
(S)-tert-butyl (2-(2- amino-2-oxoethyl)-4- ((4-fluorophenyl)sulfonyl)- 3,4-dihydro- 2H-benzo[b][1,4]oxazin-6- yl)carbamate US9809561, 37A
Type:
Small organic molecule
Emp. Form.:
C21H24FN3O6S
Mol. Mass.:
465.495
SMILES:
CC(C)(C)OC(=O)Nc1ccc2O[C@@H](CC(N)=O)CN(c2c1)S(=O)(=O)c1ccc(F)cc1
: