Target
Leucine-rich repeat serine/threonine-protein kinase 2
Ligand
BDBM352922
Substrate
Meas. Tech.
LanthaScreen Assay
IC50
309±n/a nM
Citation
 DeMong, DMiller, MLiu, HDai, XGreshock, TStamford, ANargund, R Compounds inhibiting leucine-rich repeat kinase enzyme activity US Patent  US9809568 Publication Date 11/7/2017 
Target
Name:
Leucine-rich repeat serine/threonine-protein kinase 2
Synonyms:
Dardarin LRRK2_HUMAN Leucine-rich repeat serine/threonine-protein kinase 2 PARK8
Type:
Protein
Mol. Mass.:
286113.20
Organism:
Homo sapiens (Human)
Description:
Q5S007
Residue:
2527
  
Inhibitor
Name:
BDBM352922
Synonyms:
US9809568, 8
Type:
Small organic molecule
Emp. Form.:
C20H19ClN6O
Mol. Mass.:
394.857
SMILES:
Cn1cc(cn1)-c1cc(Cl)c2[nH]nc(-c3ccnc(c3)N3CCOCC3)c2c1
: