Target
3-phosphoinositide-dependent protein kinase 1
Ligand
BDBM17024
Substrate
Serine/threonine-protein kinase AKT2
Meas. Tech.
PDK1-mediated AKT2 Activation Assay (cAKT2 33P-SPA)
pH
7.2±n/a
Temperature
295.15±n/a K
IC50
280±n/a nM
Citation
 Islam, IBryant, JChou, YLKochanny, MJLee, WPhillips, GBYu, HAdler, MWhitlow, MHo, ELentz, DPolokoff, MASubramanyam, BWu, JMZhu, DFeldman, RIArnaiz, DO Indolinone based phosphoinositide-dependent kinase-1 (PDK1) inhibitors. Part 1: design, synthesis and biological activity. Bioorg Med Chem Lett 17:3814-8 (2007)  
Target
Name:
3-phosphoinositide-dependent protein kinase 1
Synonyms:
3-Phosphoinositide-Dependent Protein Kinase 1 (PDK1) 3-phosphoinositide-dependent protein kinase 1 3-phosphoinositide-dependent protein kinase 1 (PDK-1) Isoform 2 of 3-phosphoinositide-dependent protein kinase 1 PDPK1 Phosphoinositide-dependent protein kinase 1 (PDK1) hPDK1
Type:
Enzyme
Mol. Mass.:
63157.65
Organism:
Homo sapiens (Human)
Description:
O15530
Residue:
556
  
Inhibitor
Name:
BDBM17024
Synonyms:
(3Z)-5-hydroxy-3-[(3-methyl-1H-pyrrol-2-yl)methylidene]-2,3-dihydro-1H-indol-2-one | Indolinone based inhibitor, 2b
Type:
Small organic molecule
Emp. Form.:
C14H12N2O2
Mol. Mass.:
240.2573
SMILES:
Cc1cc[nH]c1\C=C1/C(=O)Nc2ccc(O)cc12
:
Substrate
Name:
RAC-beta serine/threonine-protein kinase
Synonyms:
AKT2 PKB beta Protein kinase B (Akt 2) Protein kinase B, beta RAC-alpha serine/threonine-protein kinase (AKT2) RAC-beta serine/threonine-protein kinase (AKT2) Serine/threonine-protein kinase AKT2 | Serine/threonine-protein kinase Rac alpha/beta
Type:
Enzyme
Mol. Mass.:
55766.64
Organism:
Homo sapiens (Human)
Description:
Residue:
481