Target
3-phosphoinositide-dependent protein kinase 1 [51-359]
Ligand
BDBM17054
Substrate
PDKtide
Meas. Tech.
PDK1 Kinase Activity Assay
pH
7.5±n/a
Temperature
303.15±n/a K
IC50
6±n/a nM
Citation
 Komander, DKular, GSSchüttelkopf, AWDeak, MPrakash, KRBain, JElliott, MGarrido-Franco, MKozikowski, APAlessi, DRvan Aalten, DM Interactions of LY333531 and other bisindolyl maleimide inhibitors with PDK1. Structure 12:215-26 (2004)  
Target
Name:
3-phosphoinositide-dependent protein kinase 1 [51-359]
Synonyms:
3-Phosphoinositide-Dependent Protein Kinase 1 (PDK1) 3-phosphoinositide-dependent protein kinase 1 (aa 51-359) PDK1 (aa 51-359) PDPK1_HUMAN | hPDK1
Type:
Enzyme Catalytic Domain
Mol. Mass.:
35302.26
Organism:
Homo sapiens (Human)
Description:
O15530[51-359]
Residue:
309
  
Inhibitor
Name:
BDBM17054
Synonyms:
(2S,3R,4R,6R,18R)-18-hydroxy-3-methoxy-2-methyl-4-(methylamino)-29-oxa-1,7,17-triazaoctacyclo[12.12.2.1^{2,6}.0^{7,28}.0^{8,13}.0^{15,19}.0^{20,27}.0^{21,26}]nonacosa-8,10,12,14,19,21,23,25,27-nonaen-16-one 7-Hydroxystaurosporine | UCN-01
Type:
Small organic molecule
Emp. Form.:
C28H26N4O4
Mol. Mass.:
482.5304
SMILES:
[H][C@]12C[C@@H](NC)[C@@H](OC)[C@](C)(O1)n1c3ccccc3c3c4[C@@H](O)NC(=O)c4c4c5ccccc5n2c4c13
:
Substrate
Name:
PDKtide
Synonyms:
Synthetic PDK substrate peptide
Type:
Peptide
Mol. Mass.:
4766.24
Organism:
Description:
Residue:
39