Target
cAMP-specific 3',5'-cyclic phosphodiesterase 4B
Ligand
BDBM354672
Substrate
Meas. Tech.
HTRF assay
IC50
5.5±n/a nM
Citation
 Armani, EAmari, GBlackaby, WVan De Poel, HBaker-Glenn, CTrivedi, N Aminoester derivatives US Patent  US9809582 Publication Date 11/7/2017 
Target
Name:
cAMP-specific 3',5'-cyclic phosphodiesterase 4B
Synonyms:
3',5'-cyclic phosphodiesterase Isoform PDE4B1 PDE4B PDE4B_HUMAN Phosphodiesterase 4B (PDE4B) Phosphodiesterase Type 4 (PDE4B)
Type:
Protein
Mol. Mass.:
83318.87
Organism:
Homo sapiens (Human)
Description:
Q07343
Residue:
736
  
Inhibitor
Name:
BDBM354672
Synonyms:
US9809582, Example 16
Type:
Small organic molecule
Emp. Form.:
C36H37Cl2N3O7S
Mol. Mass.:
726.666
SMILES:
COc1ccc(cc1OC)[C@H](Cc1c(Cl)c[n+]([O-])cc1Cl)OC(=O)c1ccc(CN2CC(C2)(C(=O)O[C@@H]2CCN(C)C2)c2ccccc2)s1
: