Target
Muscarinic acetylcholine receptor M3
Ligand
BDBM354674
Substrate
Meas. Tech.
Radioligand Binding Assay
IC50
<1±n/a nM
Citation
 Armani, EAmari, GBlackaby, WVan De Poel, HBaker-Glenn, CTrivedi, N Aminoester derivatives US Patent  US9809582 Publication Date 11/7/2017 
Target
Name:
Muscarinic acetylcholine receptor M3
Synonyms:
ACM3_HUMAN Cholinergic, muscarinic M3 Muscarinic receptor M3 | RecName: Full=Muscarinic acetylcholine receptor M3
Type:
Enzyme
Mol. Mass.:
66151.03
Organism:
Homo sapiens (Human)
Description:
P20309
Residue:
590
  
Inhibitor
Name:
BDBM354674
Synonyms:
Single diastereoisomers of [(1S)-2-(3,5-dichloro-1-oxido-pyridin-1-ium-4-yl)-1-(3,4-dimethoxyphenyl)ethyl] 5-[[[2-hydroxy-3-oxo-2-phenyl-3-[(3R)-quinuclidin-3-yl]oxy-propyl]amino]methyl]thiophene-2-carboxylate (diastereoisomers 1 and 2) | US9809582, Example 18
Type:
Small organic molecule
Emp. Form.:
C37H39Cl2N3O8S
Mol. Mass.:
756.692
SMILES:
COc1ccc(cc1OC)[C@H](Cc1c(Cl)c[n+]([O-])cc1Cl)OC(=O)c1ccc(CNC[C@@](O)(C(=O)O[C@H]2CN3CCC2CC3)c2ccccc2)s1
: