Target
Muscarinic acetylcholine receptor M3
Ligand
BDBM354688
Substrate
Meas. Tech.
Radioligand Binding Assay
IC50
5.5±n/a nM
Citation
 Armani, EAmari, GBlackaby, WVan De Poel, HBaker-Glenn, CTrivedi, N Aminoester derivatives US Patent  US9809582 Publication Date 11/7/2017 
Target
Name:
Muscarinic acetylcholine receptor M3
Synonyms:
ACM3_HUMAN Cholinergic, muscarinic M3 Muscarinic receptor M3 | RecName: Full=Muscarinic acetylcholine receptor M3
Type:
Enzyme
Mol. Mass.:
66151.03
Organism:
Homo sapiens (Human)
Description:
P20309
Residue:
590
  
Inhibitor
Name:
BDBM354688
Synonyms:
US9809582, Example 33 US9809582, Example 37
Type:
Small organic molecule
Emp. Form.:
C39H41Cl2N3O7S
Mol. Mass.:
766.73
SMILES:
COc1ccc(cc1OC)[C@H](Cc1c(Cl)c[n+]([O-])cc1Cl)OC(=O)c1ccc(CNC2CC(C2)(C(=O)O[C@H]2CN3CCC2CC3)c2ccccc2)s1
: