Target
Phosphatidylinositol 4,5-bisphosphate 3-kinase catalytic subunit alpha isoform
Ligand
BDBM228154
Substrate
Meas. Tech.
In Vitro PI3K Alpha Binding Assay
pH
7.5±n/a
Ki
8±0 nM
IC50
76±0 nM
Comments
extracted
Citation
 Zhang, YLiu, BLiu, JZhang, JCheng, C Aminoquinazoline derivatives and their salts and methods of use thereof US Patent  US9556191 Publication Date 1/31/2017 
Target
Name:
Phosphatidylinositol 4,5-bisphosphate 3-kinase catalytic subunit alpha isoform
Synonyms:
P42336 PI3-kinase subunit p110-alpha PIK3CA Phosphatidylinositol 3-kinase alpha (PI3Kalpha) Phosphatidylinositol 4,5-bisphosphate 3-kinase (PI3K) Phosphatidylinositol 4,5-bisphosphate 3-kinase catalytic subunit alpha (PI3Kalpha) Phosphatidylinositol 4,5-bisphosphate 3-kinase catalytic subunit alpha isoform (PI3-Ka) Phosphatidylinositol 4,5-bisphosphate 3-kinase catalytic subunit alpha isoform (PI3K p110alpha) Phosphatidylinositol 4,5-bisphosphate 3-kinase catalytic subunit alpha isoform (PI3K-alpha) Phosphatidylinositol 4,5-bisphosphate 3-kinase catalytic subunit alpha isoform (PI3Kalpha p110alpha) Phosphatidylinositol 4,5-bisphosphate 3-kinase catalytic subunit alpha isoform (PIK3CA) Phosphatidylinositol-4,5-bisphosphate 3-kinase catalytic subunit alpha isoform Phosphoinositide 3-Kinase (PI3K), alpha Chain A Phosphoinositide 3-kinases (PI3K) PtdIns-3-kinase p110 | p110 alpha
Type:
Enzyme Subunit
Mol. Mass.:
124294.87
Organism:
Homo sapiens (Human)
Description:
P42336
Residue:
1068
  
Inhibitor
Name:
BDBM228154
Synonyms:
(S)-5-(4-morpholino-5a,6,8,9-tetrahydro-5H- pyrimido[5',4':4,5]pyrrolo[2,1-c][1,4]oxazin-2- yl)pyrimidin-2-amine | US9556203, 25
Type:
Small organic molecule
Emp. Form.:
C17H21N7O2
Mol. Mass.:
355.3943
SMILES:
Nc1ncc(cn1)-c1nc2N3CCOC[C@@H]3Cc2c(n1)N1CCOCC1
: