Target
Androgen receptor
Ligand
BDBM354703
Substrate
Meas. Tech.
Binding Assay
IC50
10.5±n/a nM
Citation
 Choi, SPChoi, SMSon, BHKim, HJKim, JMJang, BJSung, JHLee, JHKim, EKang, KKKim, S Oxazolidine-based compound and selective androgen receptor agonist comprising same US Patent  US9809583 Publication Date 11/7/2017 
Target
Name:
Androgen receptor
Synonyms:
Type:
Mol. Mass.:
97086.15
Organism:
Chlorocebus sabaeus (Green monkey) (Cercopithecus sabaeus)
Description:
A0A0D9RHK8
Residue:
900
  
Inhibitor
Name:
BDBM354703
Synonyms:
Preparation of 4-((2R,5S)-5-((4-cyano-2-fluorophenoxy)methyl)-2-(trifluoromethyl)oxazolidin-3-yl)-2-(trifluoromethyl)benzonitrile | US9809583, Example 11
Type:
Small organic molecule
Emp. Form.:
C20H12F7N3O2
Mol. Mass.:
459.317
SMILES:
Fc1cc(ccc1OC[C@@H]1CN([C@H](O1)C(F)(F)F)c1ccc(C#N)c(c1)C(F)(F)F)C#N
: