Target
Mitogen-activated protein kinase kinase kinase 11
Ligand
BDBM354776
Substrate
Meas. Tech.
Radiometric Filter Plate Assay
IC50
550±n/a nM
Citation
 Gelbard, HADewhurst, SGoodfellow, VSLoweth, CJWiemann, T Substituted pyrrolo[2,3-b]pyridines as MLK inhibitors US Patent  US9814704 Publication Date 11/14/2017 
Target
Name:
Mitogen-activated protein kinase kinase kinase 11
Synonyms:
M3K11_HUMAN MLK3 Mixed Lineage Kinase 3 (MLK3) SPRK
Type:
PROTEIN
Mol. Mass.:
92696.93
Organism:
Homo sapiens (Human)
Description:
ChEMBL_1460565
Residue:
847
  
Inhibitor
Name:
BDBM354776
Synonyms:
1,6-di(1H-indol-5-yl)-1H- imidazo[4,5-b]pyrazin- 2(3H)-one US9814704, Example 53
Type:
Small organic molecule
Emp. Form.:
C21H14N6O
Mol. Mass.:
366.3755
SMILES:
O=c1[nH]c2ncc(nc2n1-c1ccc2[nH]ccc2c1)-c1ccc2[nH]ccc2c1
: