Target
Mitogen-activated protein kinase kinase kinase 11
Ligand
BDBM354822
Substrate
Meas. Tech.
Radiometric Filter Plate Assay
IC50
>1000±n/a nM
Citation
 Gelbard, HADewhurst, SGoodfellow, VSLoweth, CJWiemann, T Substituted pyrrolo[2,3-b]pyridines as MLK inhibitors US Patent  US9814704 Publication Date 11/14/2017 
Target
Name:
Mitogen-activated protein kinase kinase kinase 11
Synonyms:
M3K11_HUMAN MLK3 Mixed Lineage Kinase 3 (MLK3) SPRK
Type:
PROTEIN
Mol. Mass.:
92696.93
Organism:
Homo sapiens (Human)
Description:
ChEMBL_1460565
Residue:
847
  
Inhibitor
Name:
BDBM354822
Synonyms:
1-(benzo[d]thiazol-5-yl)-6- (3,5-dimethylphenyl)-1H- imidazo[4,5-b]pyrazin- 2(3H)-one US9814704, Example 99
Type:
Small organic molecule
Emp. Form.:
C20H15N5OS
Mol. Mass.:
373.431
SMILES:
Cc1cc(C)cc(c1)-c1cnc2[nH]c(=O)n(-c3ccc4scnc4c3)c2n1
: