Target
Mitogen-activated protein kinase kinase kinase 11
Ligand
BDBM354849
Substrate
Meas. Tech.
Radiometric Filter Plate Assay
IC50
>1000±n/a nM
Citation
 Gelbard, HADewhurst, SGoodfellow, VSLoweth, CJWiemann, T Substituted pyrrolo[2,3-b]pyridines as MLK inhibitors US Patent  US9814704 Publication Date 11/14/2017 
Target
Name:
Mitogen-activated protein kinase kinase kinase 11
Synonyms:
M3K11_HUMAN MLK3 Mixed Lineage Kinase 3 (MLK3) SPRK
Type:
PROTEIN
Mol. Mass.:
92696.93
Organism:
Homo sapiens (Human)
Description:
ChEMBL_1460565
Residue:
847
  
Inhibitor
Name:
BDBM354849
Synonyms:
US10485800, Example 126 | US9814704, Example 126
Type:
Small organic molecule
Emp. Form.:
C22H19N5O3
Mol. Mass.:
401.418
SMILES:
COc1cc(cc(OC)c1OC)-c1cnc2ncn(-c3ccc4[nH]ccc4c3)c2n1
: