Target
Mitogen-activated protein kinase kinase kinase 11
Ligand
BDBM354859
Substrate
Meas. Tech.
Radiometric Filter Plate Assay
IC50
>1000±n/a nM
Citation
 Gelbard, HADewhurst, SGoodfellow, VSLoweth, CJWiemann, T Substituted pyrrolo[2,3-b]pyridines as MLK inhibitors US Patent  US9814704 Publication Date 11/14/2017 
Target
Name:
Mitogen-activated protein kinase kinase kinase 11
Synonyms:
M3K11_HUMAN MLK3 Mixed Lineage Kinase 3 (MLK3) SPRK
Type:
PROTEIN
Mol. Mass.:
92696.93
Organism:
Homo sapiens (Human)
Description:
ChEMBL_1460565
Residue:
847
  
Inhibitor
Name:
BDBM354859
Synonyms:
Preparation of 3-pyridin-4-ylmethyl-5-(3,4,5-trimethoxy-phenyl)-1,3-dihydro-pyrrolo[2,3-b]pyridin-2-one | US9814704, Example 136
Type:
Small organic molecule
Emp. Form.:
C22H19N3O4
Mol. Mass.:
389.404
SMILES:
COc1cc(cc(OC)c1OC)-c1cnc2NC(=O)C(=Cc3ccncc3)c2c1
: