Target
Mitogen-activated protein kinase kinase kinase 11
Ligand
BDBM354872
Substrate
Meas. Tech.
Radiometric Filter Plate Assay
IC50
<100±n/a nM
Citation
 Gelbard, HADewhurst, SGoodfellow, VSLoweth, CJWiemann, T Substituted pyrrolo[2,3-b]pyridines as MLK inhibitors US Patent  US9814704 Publication Date 11/14/2017 
Target
Name:
Mitogen-activated protein kinase kinase kinase 11
Synonyms:
M3K11_HUMAN MLK3 Mixed Lineage Kinase 3 (MLK3) SPRK
Type:
PROTEIN
Mol. Mass.:
92696.93
Organism:
Homo sapiens (Human)
Description:
ChEMBL_1460565
Residue:
847
  
Inhibitor
Name:
BDBM354872
Synonyms:
Preparation of 4-{5-[4-(piperazine-1-carbonyl)-phenyl]-1H-pyrrolo[2,3-b]pyridin-3-yl}-benzamide, hydrochloride salt US9814704, Example 149
Type:
Small organic molecule
Emp. Form.:
C25H24N5O2
Mol. Mass.:
426.4898
SMILES:
NC(=O)c1ccc(cc1)-c1c[nH]c2ncc(cc12)-c1ccc(cc1)C(=O)N1CC[NH2+]CC1
: