Target
Oxysterols receptor LXR-beta
Ligand
BDBM354727
Substrate
Meas. Tech.
Radioligand Binding Assay
Ki
256±n/a nM
Citation
 Dong, CFan, YLeftheris, KLotesta, SDSingh, SBTice, CMZhao, WZheng, YZhuang, L Liver X receptor modulators US Patent  US9814715 Publication Date 11/14/2017 
Target
Name:
Oxysterols receptor LXR-beta
Synonyms:
LXRB Liver X, LXR beta NR1H2 Nuclear receptor NER Ubiquitously-expressed nuclear receptor
Type:
Enzyme Catalytic Domain
Mol. Mass.:
50978.79
Organism:
Homo sapiens (Human)
Description:
P55055
Residue:
460
  
Inhibitor
Name:
BDBM354727
Synonyms:
1-isopropyl-7-(methylsulfonyl)-2-(4-(trifluoromethyl)pyrimidin-2-yl)-1,2,3,4-tetrahydrobenzo[4,5]imidazo[1,2-a]pyrazine | US9814715, Example 1
Type:
Small organic molecule
Emp. Form.:
C19H20F3N5O2S
Mol. Mass.:
439.455
SMILES:
CC(C)C1N(CCn2c1nc1ccc(cc21)S(C)(=O)=O)c1nccc(n1)C(F)(F)F
: