Target
Cyclin-A2/Cyclin-dependent kinase 2
Ligand
BDBM17151
Substrate
Histone H1
Meas. Tech.
CDK Inhibition Assay
pH
7.5±n/a
Temperature
295.15±n/a K
IC50
30±n/a nM
Citation
 Richardson, CMNunns, CLWilliamson, DSParratt, MJDokurno, PHowes, RBorgognoni, JDrysdale, MJFinch, HHubbard, REJackson, PSKierstan, PLentzen, GMoore, JDMurray, JBSimmonite, HSurgenor, AETorrance, CJ Discovery of a potent CDK2 inhibitor with a novel binding mode, using virtual screening and initial, structure-guided lead scoping. Bioorg Med Chem Lett 17:3880-5 (2007)  
Target
Name:
Cyclin-A2/Cyclin-dependent kinase 2
Synonyms:
CDK2-CyclinA CDK2/Cyclin A Cyclin A2/dependent kinase 2 Cyclin-Dependent Kinase 2 (CDK2A)
Type:
Protein Complex
Mol. Mass.:
Description:
Cdk2/Cyclin A kinase was purified from insect cells coinfected with Cyclin A/Cdk2 baculovirus.
Components:
This complex has 2 components.
Component 1
Name:
Cyclin-dependent kinase 2
Synonyms:
CDK2 CDK2_HUMAN Cell division protein kinase 2 Protein cereblon/Cyclin-dependent kinase 2 | p33 protein kinase
Type:
Enzyme Subunit
Mol. Mass.:
33938.17
Organism:
Homo sapiens (Human)
Description:
P24941
Residue:
298
  
Component 2
Name:
Cyclin-A2
Synonyms:
CCN1 CCNA1 CCNA2_HUMAN Cyclin-A
Type:
Enzyme Subunit
Mol. Mass.:
48550.19
Organism:
Homo sapiens (Human)
Description:
P20248
Residue:
432
  
Inhibitor
Name:
BDBM17151
Synonyms:
2-imino-thiazolidin-4-one analog, 13 | 4-(5-{1-[(5Z)-2-imino-4-oxo-1,3-thiazolidin-5-ylidene]ethyl}furan-2-yl)benzene-1-sulfonamide
Type:
Small organic molecule
Emp. Form.:
C15H13N3O4S2
Mol. Mass.:
363.411
SMILES:
C\C(=C1\SC(=N)NC1=O)c1ccc(o1)-c1ccc(cc1)S(N)(=O)=O
:
Substrate
Name:
Histone H1
Synonyms:
Type:
Other Protein Type
Mol. Mass.:
358.43
Organism:
Bos taurus (bovine)
Description:
Residue:
3
NA