Target
Cannabinoid receptor 2
Ligand
BDBM354900
Substrate
Meas. Tech.
cAMP Assay
EC50
1900±n/a nM
Citation
 Macielag, MJZhang, YGreco, MNSpringer, BAMurray, WV Chemically modified quinoline and quinolone derivatives useful as CB-1 inverse agonists US Patent  US9815790 Publication Date 11/14/2017 
Target
Name:
Cannabinoid receptor 2
Synonyms:
CANNABINOID CB2 CB2 CB2B CNR2_HUMAN Cannabinoid CB2 receptor Cannabinoid receptor 2 (CB2R) | hCB2
Type:
G Protein-Coupled Receptor (GPCR)
Mol. Mass.:
39690.94
Organism:
Homo sapiens (Human)
Description:
P34972
Residue:
360
  
Inhibitor
Name:
BDBM354900
Synonyms:
US9815790, 15
Type:
Small organic molecule
Emp. Form.:
C48H64Cl2F3N3O13S
Mol. Mass.:
1051
SMILES:
c1cc(cc2c(NC3CCN(CC3)S(=O)(=O)C(F)(F)F)ccnc12)C(c1ccc(Cl)cc1)c1ccc(Cl)cc1
: