Target
Cannabinoid receptor 2
Ligand
BDBM354906
Substrate
Meas. Tech.
cAMP Assay
EC50
>10000±n/a nM
Citation
 Macielag, MJZhang, YGreco, MNSpringer, BAMurray, WV Chemically modified quinoline and quinolone derivatives useful as CB-1 inverse agonists US Patent  US9815790 Publication Date 11/14/2017 
Target
Name:
Cannabinoid receptor 2
Synonyms:
CANNABINOID CB2 CB2 CB2B CNR2_HUMAN Cannabinoid CB2 receptor Cannabinoid receptor 2 (CB2R) | hCB2
Type:
G Protein-Coupled Receptor (GPCR)
Mol. Mass.:
39690.94
Organism:
Homo sapiens (Human)
Description:
P34972
Residue:
360
  
Inhibitor
Name:
BDBM354906
Synonyms:
US9815790, 21
Type:
Small organic molecule
Emp. Form.:
C37H42Cl2F3N3O7S
Mol. Mass.:
800.711
SMILES:
COCCOCCOCCOCCn1c2ccc(cc2c(NC2CCN(CC2)S(=O)(=O)C(F)(F)F)cc1=O)C(c1ccc(Cl)cc1)c1ccc(Cl)cc1
: