Target
Dipeptidyl peptidase 4
Ligand
BDBM50228394
Substrate
Meas. Tech.
Fluorescence Assay
pH
7.8±n/a
IC50
1±0 nM
Comments
extracted
Citation
 Himmelsbach, FLangkopf, EEckhardt, MMark, MMaier, RLotz, RTadayyon, M 8-[3-amino-piperidin-1-yl]-xanthines, the preparation thereof and thier use as pharmaceutical compositions US Patent  US9556175 Publication Date 1/31/2017 
Target
Name:
Dipeptidyl peptidase 4
Synonyms:
ADABP Adenosine deaminase complexing protein 2 CD_antigen=CD26 DPP4 DPPIV Dipeptidyl peptidase 4 (DPP IV) Dipeptidyl peptidase 4 (DPP4) Dipeptidyl peptidase 4 membrane form Dipeptidyl peptidase IV Dipeptidyl peptidase IV (DDP-IV) Dipeptidyl peptidase IV membrane form Dipeptidyl peptidase-IV (DPP-4) T-cell activation antigen CD26 | TP103
Type:
Enzyme
Mol. Mass.:
88271.01
Organism:
Homo sapiens (Human)
Description:
P27487
Residue:
766
  
Inhibitor
Name:
BDBM50228394
Synonyms:
(R)-2-(2-(2-(8-(3-aminopiperidin-1-yl)-7-(but-2-ynyl)-3-methyl-2,6-dioxo-2,3-dihydro-6H-purin-1(7H)-yl)acetyl)phenoxy)-N-methylacetamide US10202383, Example 2(99) US9556175, 2(99)
Type:
Small organic molecule
Emp. Form.:
C26H31N7O5
Mol. Mass.:
521.5682
SMILES:
CNC(=O)COc1ccccc1C(=O)Cn1c(=O)n(C)c2nc(N3CCC[C@@H](N)C3)n(CC#CC)c2c1=O
: