Target
Serine protease 1
Ligand
BDBM17233
Substrate
BDBM17139
Meas. Tech.
Enzyme Inhibition Assay
Ki
>5000±n/a nM
Citation
 Kochanny, MJAdler, MEwing, JGriedel, BDHo, EKaranjawala, RLee, WLentz, DLiang, AMMorrissey, MMPhillips, GBPost, JSacchi, KLSakata, STSubramanyam, BVergona, RWalters, JWhite, KAWhitlow, MYe, BZhao, ZShaw, KJ Substituted thiophene-anthranilamides as potent inhibitors of human factor Xa. Bioorg Med Chem 15:2127-46 (2007)  
Target
Name:
Serine protease 1
Synonyms:
Beta-Trypsin PRSS1 TRY1 TRYP1 Trypsin I
Type:
Enzyme
Mol. Mass.:
25790.52
Organism:
Bos taurus (bovine)
Description:
P00760
Residue:
246
  
Inhibitor
Name:
BDBM17233
Synonyms:
3-chloro-N-{4-chloro-2-[(4-chlorophenyl)carbamoyl]phenyl}-6-[(dimethylamino)methyl]-1-benzothiophene-2-carboxamide | benzothiophene compound, 12
Type:
Small organic molecule
Emp. Form.:
C25H20Cl3N3O2S
Mol. Mass.:
532.869
SMILES:
CN(C)Cc1ccc2c(Cl)c(sc2c1)C(=O)Nc1ccc(Cl)cc1C(=O)Nc1ccc(Cl)cc1
:
Substrate
Name:
BDBM17139
Synonyms:
(2S)-2-[(2R)-2-amino-3-methylbutanamido]-N-[(1S)-4-carbamimidamido-1-[(4-nitrophenyl)carbamoyl]butyl]-4-methylpentanamide dihydrochloride H-D-Val-Leu-Arg-pNA ¿¿¿¿ 2HCl H-D-Valyl-L-leucyl-L-argininep-Nitroaniline dihydrochloride
Type:
Small organic molecule
Emp. Form.:
C23H38N8O5
Mol. Mass.:
506.5984
SMILES:
CC(C)CC(NC(=O)C(N)C(C)C)C(=O)NC(CCC\[NH+]=C(/N)[NH-])C(=O)Nc1ccc(cc1)[N+]([O-])=O
: