Target
Phosphodiesterase
Ligand
BDBM355174
Substrate
Meas. Tech.
Fluorescence Polarization (FP) Assay
Ki
1.20±n/a nM
Citation
 Shen, DMEgbertson, MBerger, RQian, XQian, YHarper, BYang, MGuo, ZZRada, VLWang, DCernak, TASinz, CWang, MWilson, JEXu, S Pyrimidone carboxamide compounds as PDE2 inhibitors US Patent  US9815796 Publication Date 11/14/2017 
Target
Name:
Phosphodiesterase
Synonyms:
PDE2A3 | Phosphodiesterase A3 (PDE2A3)
Type:
Enzyme Catalytic Domain
Mol. Mass.:
105547.91
Organism:
Macaca mulatta (Rhesus macaque)
Description:
Residue:
941
  
Inhibitor
Name:
BDBM355174
Synonyms:
N-{(1R)-2-methyl-1-[4-(pentafluoro- lambda6-sulfanyl)phenyl]propyl}-6-oxo-1,6- dihydro-2,2'-bipyrimidine-4- carboxamide | US9815796, Example 265
Type:
Small organic molecule
Emp. Form.:
C19H18F5N5O2S
Mol. Mass.:
475.436
SMILES:
CC(C)[C@@H](NC(=O)c1cc(=O)[nH]c(n1)-c1ncccn1)c1ccc(cc1)S(F)(F)(F)(F)F
: