Target
Phosphodiesterase
Ligand
BDBM355374
Substrate
Meas. Tech.
Fluorescence Polarization (FP) Assay
Ki
0.620±n/a nM
Citation
 Shen, DMEgbertson, MBerger, RQian, XQian, YHarper, BYang, MGuo, ZZRada, VLWang, DCernak, TASinz, CWang, MWilson, JEXu, S Pyrimidone carboxamide compounds as PDE2 inhibitors US Patent  US9815796 Publication Date 11/14/2017 
Target
Name:
Phosphodiesterase
Synonyms:
PDE2A3 | Phosphodiesterase A3 (PDE2A3)
Type:
Enzyme Catalytic Domain
Mol. Mass.:
105547.91
Organism:
Macaca mulatta (Rhesus macaque)
Description:
Residue:
941
  
Inhibitor
Name:
BDBM355374
Synonyms:
N-[(1R)-2,2-dimethyl-1-{4- [(trifluoromethyl)sulfanyl]phenyl} propyl]-2-(4-methoxybenzyl)-6-oxo- 1,6-dihydropyrimidine-4- carboxamide | US9815796, Example 465
Type:
Small organic molecule
Emp. Form.:
C25H26F3N3O3S
Mol. Mass.:
505.552
SMILES:
COc1ccc(Cc2nc(cc(=O)[nH]2)C(=O)N[C@@H](c2ccc(SC(F)(F)F)cc2)C(C)(C)C)cc1
: