Target
cGMP-dependent 3',5'-cyclic phosphodiesterase
Ligand
BDBM355378
Substrate
Meas. Tech.
Fluorescence Polarization (FP) Assay
Ki
0.910±n/a nM
Citation
 Shen, DMEgbertson, MBerger, RQian, XQian, YHarper, BYang, MGuo, ZZRada, VLWang, DCernak, TASinz, CWang, MWilson, JEXu, S Pyrimidone carboxamide compounds as PDE2 inhibitors US Patent  US9815796 Publication Date 11/14/2017 
Target
Name:
cGMP-dependent 3',5'-cyclic phosphodiesterase
Synonyms:
CGS-PDE Homo sapiens phosphodiesterase 2A (PDE2A) PDE2A cGSPDE
Type:
Enzyme Catalytic Domain
Mol. Mass.:
105691.58
Organism:
Homo sapiens (Human)
Description:
O00408
Residue:
941
  
Inhibitor
Name:
BDBM355378
Synonyms:
2-(4-methoxybenzyl)-N-[(1R)-2- methyl-1-{4- [(trifluoromethyl)sulfanyl]phenyl} propyl]-6-oxo-1,6- dihydropyrimidine-4-carboxamide | US9815796, Example 469
Type:
Small organic molecule
Emp. Form.:
C24H24F3N3O3S
Mol. Mass.:
491.526
SMILES:
COc1ccc(Cc2nc(cc(=O)[nH]2)C(=O)N[C@H](C(C)C)c2ccc(SC(F)(F)F)cc2)cc1
: