Target
cGMP-dependent 3',5'-cyclic phosphodiesterase
Ligand
BDBM355448
Substrate
Meas. Tech.
Fluorescence Polarization (FP) Assay
Ki
1.20±n/a nM
Citation
 Shen, DMEgbertson, MBerger, RQian, XQian, YHarper, BYang, MGuo, ZZRada, VLWang, DCernak, TASinz, CWang, MWilson, JEXu, S Pyrimidone carboxamide compounds as PDE2 inhibitors US Patent  US9815796 Publication Date 11/14/2017 
Target
Name:
cGMP-dependent 3',5'-cyclic phosphodiesterase
Synonyms:
CGS-PDE Homo sapiens phosphodiesterase 2A (PDE2A) PDE2A cGSPDE
Type:
Enzyme Catalytic Domain
Mol. Mass.:
105691.58
Organism:
Homo sapiens (Human)
Description:
O00408
Residue:
941
  
Inhibitor
Name:
BDBM355448
Synonyms:
N-[(1R)-1-(4-cyclopropyl-3- fluorophenyl)-2,2-dimethylpropyl]- 6-oxo-2-phenyl-1,6- dihydropyrimidine-4-carboxamide | US9815796, Example 539
Type:
Small organic molecule
Emp. Form.:
C25H26FN3O2
Mol. Mass.:
419.4912
SMILES:
CC(C)(C)[C@@H](NC(=O)c1cc(=O)[nH]c(n1)-c1ccccc1)c1ccc(C2CC2)c(F)c1
: