Target
Complement factor D
Ligand
BDBM355663
Substrate
Meas. Tech.
Inhibition Assay
IC50
172±n/a nM
Citation
 Altmann, EHommel, ULorthiois, ELMaibaum, JKOstermann, NQuancard, JRandl, SARogel, OVulpetti, A Complement pathway modulators and uses thereof US Patent  US9815819 Publication Date 11/14/2017 
Target
Name:
Complement factor D
Synonyms:
Adipsin CFAD_HUMAN DF Properdin factor D
Type:
Protein
Mol. Mass.:
27039.19
Organism:
Homo sapiens (Human)
Description:
P00746
Residue:
253
  
Inhibitor
Name:
BDBM355663
Synonyms:
(1R,3S,5S)-2-[2-(3-Acetyl-pyrazolo[3,4-b]pyridin-1-yl)-acetyl]-5-hydroxymethyl-2-aza-bicyclo[3.1.0]hexane-3-carboxylic acid((1R,2S)-2-phenyl-cyclopropyl)-amide | US9815819, 28
Type:
Small organic molecule
Emp. Form.:
C26H27N5O4
Mol. Mass.:
473.5237
SMILES:
CC(=O)c1nn(CC(=O)N2[C@@H]3C[C@]3(CO)C[C@H]2C(=O)N[C@@H]2C[C@H]2c2ccccc2)c2ncccc12
: