Target
Rho-associated protein kinase 1
Ligand
BDBM322153
Substrate
Meas. Tech.
Kinase Inhibition Assay
Ki
2010±n/a nM
Citation
 Poyurovsky, MKim, JLiu, KZanin-Zhorov, A Rho kinase inhibitors US Patent  US9815820 Publication Date 11/14/2017 
Target
Name:
Rho-associated protein kinase 1
Synonyms:
ROCK-I ROCK1_HUMAN Rho-associated protein kinase Rho-associated, coiled-coil-containing protein kinase 1 Rho-kinase (ROCK I) p160 ROCK-1 | p160ROCK
Type:
Serine/threonine-protein kinase
Mol. Mass.:
158156.77
Organism:
Homo sapiens (Human)
Description:
Q13464
Residue:
1354
  
Inhibitor
Name:
BDBM322153
Synonyms:
2-(3-(4-((1H-indazol-5-yl)amino)-5-methylpyrimidin-2-yl)phenoxy)-N-cyclopropylacetamide hydrochloride US10696660, Example 26 US9815820, ex. 26
Type:
Small organic molecule
Emp. Form.:
C23H22N6O2
Mol. Mass.:
414.4598
SMILES:
Cc1cnc(nc1Nc1ccc2[nH]ncc2c1)-c1cccc(OCC(=O)NC2CC2)c1
: