Target
Rho-associated protein kinase 1
Ligand
BDBM322155
Substrate
Meas. Tech.
Kinase Inhibition Assay
Ki
500±n/a nM
Citation
 Poyurovsky, MKim, JLiu, KZanin-Zhorov, A Rho kinase inhibitors US Patent  US9815820 Publication Date 11/14/2017 
Target
Name:
Rho-associated protein kinase 1
Synonyms:
ROCK-I ROCK1_HUMAN Rho-associated protein kinase Rho-associated, coiled-coil-containing protein kinase 1 Rho-kinase (ROCK I) p160 ROCK-1 | p160ROCK
Type:
Serine/threonine-protein kinase
Mol. Mass.:
158156.77
Organism:
Homo sapiens (Human)
Description:
Q13464
Residue:
1354
  
Inhibitor
Name:
BDBM322155
Synonyms:
US10183931, SLx-2119 US11311541, Example SLx-2119 | US9815820, SLx-2119
Type:
Small organic molecule
Emp. Form.:
C26H24N6O2
Mol. Mass.:
452.5078
SMILES:
CC(C)NC(=O)COc1cccc(c1)-c1nc(Nc2ccc3[nH]ncc3c2)c2ccccc2n1
: