Target
Rho-associated protein kinase 1
Ligand
BDBM322158
Substrate
Meas. Tech.
Kinase Inhibition Assay
IC50
330±n/a nM
Citation
 Poyurovsky, MKim, JLiu, KZanin-Zhorov, A Rho kinase inhibitors US Patent  US9815820 Publication Date 11/14/2017 
Target
Name:
Rho-associated protein kinase 1
Synonyms:
ROCK-I ROCK1_HUMAN Rho-associated protein kinase Rho-associated, coiled-coil-containing protein kinase 1 Rho-kinase (ROCK I) p160 ROCK-1 | p160ROCK
Type:
Serine/threonine-protein kinase
Mol. Mass.:
158156.77
Organism:
Homo sapiens (Human)
Description:
Q13464
Residue:
1354
  
Inhibitor
Name:
BDBM322158
Synonyms:
2-(3-(4-((1H-indazol-5-yl)amino)-6-(4-methylpiperazin-1-yl)pyrimidin-2-yl)phenoxy)-N-isopropylacetamide TFA salt US10696660, Example 48 US9815820, 48
Type:
Small organic molecule
Emp. Form.:
C27H32N8O2
Mol. Mass.:
500.5954
SMILES:
CC(C)NC(=O)COc1cccc(c1)-c1nc(Nc2ccc3[nH]ncc3c2)cc(n1)N1CCN(C)CC1
: