Target
cAMP-specific 3',5'-cyclic phosphodiesterase 4D
Ligand
BDBM355741
Substrate
Meas. Tech.
Scintillation Proximity Assay (SPA)
IC50
2140±n/a nM
Citation
 Chappie, TAVerhoest, PRPatel, NCHayward, MM Azabenzimidazole compounds US Patent  US9815832 Publication Date 11/14/2017 
Target
Name:
cAMP-specific 3',5'-cyclic phosphodiesterase 4D
Synonyms:
3',5'-cyclic phosphodiesterase PDE43 PDE4D_HUMAN | Phosphodiesterase 4D
Type:
Protein
Mol. Mass.:
91092.69
Organism:
Homo sapiens (Human)
Description:
Q08499
Residue:
809
  
Inhibitor
Name:
BDBM355741
Synonyms:
Azetidin-1-yl[3-(3-fluoro-4-methylphenyl)-3H-imidazo[4,5-b]pyridin-2-yl]methanone | US9815832, 18
Type:
Small organic molecule
Emp. Form.:
C17H15FN4O
Mol. Mass.:
310.3256
SMILES:
Cc1ccc(cc1F)-n1c(nc2cccnc12)C(=O)N1CCC1
: