Target
cAMP-specific 3',5'-cyclic phosphodiesterase 4D
Ligand
BDBM355750
Substrate
Meas. Tech.
Scintillation Proximity Assay (SPA)
IC50
511±n/a nM
Citation
 Chappie, TAVerhoest, PRPatel, NCHayward, MM Azabenzimidazole compounds US Patent  US9815832 Publication Date 11/14/2017 
Target
Name:
cAMP-specific 3',5'-cyclic phosphodiesterase 4D
Synonyms:
3',5'-cyclic phosphodiesterase PDE43 PDE4D_HUMAN | Phosphodiesterase 4D
Type:
Protein
Mol. Mass.:
91092.69
Organism:
Homo sapiens (Human)
Description:
Q08499
Residue:
809
  
Inhibitor
Name:
BDBM355750
Synonyms:
N-Cyclopropyl-3-(3,4-dichlorophenyl)-3H-imidazo[4,5-b]pyridine-2-carboxamide | US9815832, 27
Type:
Small organic molecule
Emp. Form.:
C16H12Cl2N4O
Mol. Mass.:
347.199
SMILES:
Clc1ccc(cc1Cl)-n1c(nc2cccnc12)C(=O)NC1CC1
: