Target
cAMP-specific 3',5'-cyclic phosphodiesterase 4B
Ligand
BDBM355764
Substrate
Meas. Tech.
Scintillation Proximity Assay (SPA)
IC50
100.0±n/a nM
Citation
 Chappie, TAVerhoest, PRPatel, NCHayward, MM Azabenzimidazole compounds US Patent  US9815832 Publication Date 11/14/2017 
Target
Name:
cAMP-specific 3',5'-cyclic phosphodiesterase 4B
Synonyms:
3',5'-cyclic phosphodiesterase Isoform PDE4B1 PDE4B PDE4B_HUMAN Phosphodiesterase 4B (PDE4B) Phosphodiesterase Type 4 (PDE4B)
Type:
Protein
Mol. Mass.:
83318.87
Organism:
Homo sapiens (Human)
Description:
Q07343
Residue:
736
  
Inhibitor
Name:
BDBM355764
Synonyms:
3-(4-Chloro-2,5-difluorophenyl)-N-cyclopropyl-3H-imidazo[4,5-b]pyridine-2-carboxamide | US9815832, 41
Type:
Small organic molecule
Emp. Form.:
C16H11ClF2N4O
Mol. Mass.:
348.735
SMILES:
Fc1cc(c(F)cc1Cl)-n1c(nc2cccnc12)C(=O)NC1CC1
: