Target
cAMP-specific 3',5'-cyclic phosphodiesterase 4B
Ligand
BDBM355796
Substrate
Meas. Tech.
Scintillation Proximity Assay (SPA)
IC50
516±n/a nM
Citation
 Chappie, TAVerhoest, PRPatel, NCHayward, MM Azabenzimidazole compounds US Patent  US9815832 Publication Date 11/14/2017 
Target
Name:
cAMP-specific 3',5'-cyclic phosphodiesterase 4B
Synonyms:
3',5'-cyclic phosphodiesterase Isoform PDE4B1 PDE4B PDE4B_HUMAN Phosphodiesterase 4B (PDE4B) Phosphodiesterase Type 4 (PDE4B)
Type:
Protein
Mol. Mass.:
83318.87
Organism:
Homo sapiens (Human)
Description:
Q07343
Residue:
736
  
Inhibitor
Name:
BDBM355796
Synonyms:
N-Cyclopropyl-3-(2-methyl-1,3-benzothiazol-6-yl)-3H-imidazo[4,5-b]pyridine-2-carboxamide | US9815832, 73
Type:
Small organic molecule
Emp. Form.:
C18H15N5OS
Mol. Mass.:
349.41
SMILES:
Cc1nc2ccc(cc2s1)-n1c(nc2cccnc12)C(=O)NC1CC1
: