Target
Fibroblast growth factor receptor 1
Ligand
BDBM287003
Substrate
Meas. Tech.
Enzymatic Activity Assay
IC50
4.00±n/a nM
Citation
 Verner, EBrameld, KA Quinolone derivatives as fibroblast growth factor receptor inhibitors US Patent  US9815834 Publication Date 11/14/2017 
Target
Name:
Fibroblast growth factor receptor 1
Synonyms:
BFGFR Basic fibroblast growth factor receptor 1 (FGFR1) CEK FGFR-1 FGFR-1, (FL) FGFR1_HUMAN FLT2 Fibroblast growth factor receptor 1 (FGFR-1) Fms-like tyrosine kinase 2 N-sam bFGF-R | c-fgr
Type:
Receptor
Mol. Mass.:
91861.70
Organism:
Homo sapiens (Human)
Description:
P11362
Residue:
822
  
Inhibitor
Name:
BDBM287003
Synonyms:
8-(3-(4-acryloylpiperazin-1-yl)propyl)-6-(2-chloro-3,5-dimethoxyphenyl)-2-((2,2-difluoroethyl)amino)pyrido[2,3-d]pyrimidin-7(8H)-one US11078199, Cpd 35 US9815834, Compound 35
Type:
Small organic molecule
Emp. Form.:
C27H31ClF2N6O4
Mol. Mass.:
577.023
SMILES:
COc1cc(OC)c(Cl)c(c1)-c1cc2cnc(NCC(F)F)nc2n(CCCN2CCN(CC2)C(=O)C=C)c1=O
: