Target
Fibroblast growth factor receptor 1
Ligand
BDBM287555
Substrate
Meas. Tech.
Enzymatic Activity Assay
IC50
5.60±n/a nM
Citation
 Verner, EBrameld, KA Quinolone derivatives as fibroblast growth factor receptor inhibitors US Patent  US9815834 Publication Date 11/14/2017 
Target
Name:
Fibroblast growth factor receptor 1
Synonyms:
BFGFR Basic fibroblast growth factor receptor 1 (FGFR1) CEK FGFR-1 FGFR-1, (FL) FGFR1_HUMAN FLT2 Fibroblast growth factor receptor 1 (FGFR-1) Fms-like tyrosine kinase 2 N-sam bFGF-R | c-fgr
Type:
Receptor
Mol. Mass.:
91861.70
Organism:
Homo sapiens (Human)
Description:
P11362
Residue:
822
  
Inhibitor
Name:
BDBM287555
Synonyms:
8-(2-((1-acryloylazetidin-3-yl)oxy)ethyl)-6-(2,6-dichloro-3,5-dimethoxyphenyl)-2-((4-(diethylamino)butyl)amino)pyrido[2,3-d]pyrimidin-7(8H)-one US11078199, Cpd 103 US9815834, Compound 103
Type:
Small organic molecule
Emp. Form.:
C31H40Cl2N6O5
Mol. Mass.:
647.593
SMILES:
CCN(CC)CCCCNc1ncc2cc(-c3c(Cl)c(OC)cc(OC)c3Cl)c(=O)n(CCOC3CN(C3)C(=O)C=C)c2n1
: