Target
Fibroblast growth factor receptor 1
Ligand
BDBM287526
Substrate
Meas. Tech.
Enzymatic Activity Assay
IC50
1.000±n/a nM
Citation
 Verner, EBrameld, KA Quinolone derivatives as fibroblast growth factor receptor inhibitors US Patent  US9815834 Publication Date 11/14/2017 
Target
Name:
Fibroblast growth factor receptor 1
Synonyms:
BFGFR Basic fibroblast growth factor receptor 1 (FGFR1) CEK FGFR-1 FGFR-1, (FL) FGFR1_HUMAN FLT2 Fibroblast growth factor receptor 1 (FGFR-1) Fms-like tyrosine kinase 2 N-sam bFGF-R | c-fgr
Type:
Receptor
Mol. Mass.:
91861.70
Organism:
Homo sapiens (Human)
Description:
P11362
Residue:
822
  
Inhibitor
Name:
BDBM287526
Synonyms:
(R)-8-(2-((1-acryloylazetidin-3-yl)(methyl)amino)ethyl)-6-(2,6-dichloro-3,5-dimethoxyphenyl)-2-((1-methoxypropan-2-yl)amino)pyrido[2,3-d]pyrimidin-7(8H)-one US11078199, Cpd 116 US9815834, Compound 116
Type:
Small organic molecule
Emp. Form.:
C28H34Cl2N6O5
Mol. Mass.:
605.513
SMILES:
COC[C@@H](C)Nc1ncc2cc(-c3c(Cl)c(OC)cc(OC)c3Cl)c(=O)n(CCN(C)C3CN(C3)C(=O)C=C)c2n1
: