Target
Prothrombin
Ligand
BDBM17295
Substrate
BDBM17296
Meas. Tech.
Determination of Inhibition Constants
pH
8±n/a
Temperature
310.15±n/a K
Ki
140±10 nM
Citation
 Nar, HBauer, MSchmid, AStassen, JMWienen, WPriepke, HWKauffmann, IKRies, UJHauel, NH Structural basis for inhibition promiscuity of dual specific thrombin and factor Xa blood coagulation inhibitors. Structure 9:29-37 (2001)  
Target
Name:
Prothrombin
Synonyms:
Activation peptide fragment 1 Coagulation factor II Prothrombin precursor Thrombin heavy chain | Thrombin light chain
Type:
Protein
Mol. Mass.:
70029.57
Organism:
Homo sapiens (Human)
Description:
P00734
Residue:
622
  
Inhibitor
Name:
BDBM17295
Synonyms:
BIBT0871 | ethyl 2-{[(E)-{[1-(2-{[(4-carbamimidoylphenyl)amino]methyl}-1-methyl-1H-1,3-benzodiazol-5-yl)cyclopropyl](pyridin-2-yl)methylidene}amino]oxy}acetate
Type:
Small organic molecule
Emp. Form.:
C29H31N7O3
Mol. Mass.:
525.6015
SMILES:
CCOC(=O)CO\N=C(\c1ccccn1)C1(CC1)c1ccc2n(C)c(CNc3ccc(cc3)C(N)=N)nc2c1
:
Substrate
Name:
BDBM17296
Synonyms:
Not Specified
Type:
Emp. Form.:
Mol. Mass.:
SMILES:
: