Target
Prothrombin
Ligand
BDBM17298
Substrate
BDBM17296
Meas. Tech.
Determination of Inhibition Constants
pH
8±n/a
Temperature
310.15±n/a K
Ki
20±2 nM
Citation
 Nar, HBauer, MSchmid, AStassen, JMWienen, WPriepke, HWKauffmann, IKRies, UJHauel, NH Structural basis for inhibition promiscuity of dual specific thrombin and factor Xa blood coagulation inhibitors. Structure 9:29-37 (2001)  
Target
Name:
Prothrombin
Synonyms:
Activation peptide fragment 1 Coagulation factor II Prothrombin precursor Thrombin heavy chain | Thrombin light chain
Type:
Protein
Mol. Mass.:
70029.57
Organism:
Homo sapiens (Human)
Description:
P00734
Residue:
622
  
Inhibitor
Name:
BDBM17298
Synonyms:
4-[({1-methyl-5-[1-(pyrrolidin-1-ylcarbonyl)cyclopropyl]-1H-1,3-benzodiazol-2-yl}methyl)amino]benzene-1-carboximidamide | BIBM1015
Type:
Small organic molecule
Emp. Form.:
C24H28N6O
Mol. Mass.:
416.5187
SMILES:
Cn1c(CNc2ccc(cc2)C(N)=N)nc2cc(ccc12)C1(CC1)C(=O)N1CCCC1
:
Substrate
Name:
BDBM17296
Synonyms:
Not Specified
Type:
Emp. Form.:
Mol. Mass.:
SMILES:
: