Target
Interleukin-1 receptor-associated kinase 4
Ligand
BDBM355827
Substrate
Meas. Tech.
Enzymatic Assay
IC50
<100±n/a nM
Citation
 Chen, XYu, HLan, RJorand-Lebrun, CJohnson, TLGoutopoulos, A Macrocyclic compounds as IRAK1/4 inhibitors and uses thereof US Patent  US9815836 Publication Date 11/14/2017 
Target
Name:
Interleukin-1 receptor-associated kinase 4
Synonyms:
IRAK-4 IRAK4_HUMAN Interleukin-1 receptor-associated kinase 4 (IRAK4) | Renal carcinoma antigen NY-REN-64
Type:
Protein
Mol. Mass.:
51519.08
Organism:
Homo sapiens (Human)
Description:
Q9NWZ3
Residue:
460
  
Inhibitor
Name:
BDBM355827
Synonyms:
US9815836, Compound 12
Type:
Small organic molecule
Emp. Form.:
C24H29N7O3
Mol. Mass.:
463.5322
SMILES:
O=C1NCCCCCCn2cc(cn2)-c2cccc(n2)C(=O)Nc2cn(nc12)C1CCOCC1
: