Target
Interleukin-1 receptor-associated kinase 4
Ligand
BDBM355836
Substrate
Meas. Tech.
Enzymatic Assay
IC50
550±n/a nM
Citation
 Chen, XYu, HLan, RJorand-Lebrun, CJohnson, TLGoutopoulos, A Macrocyclic compounds as IRAK1/4 inhibitors and uses thereof US Patent  US9815836 Publication Date 11/14/2017 
Target
Name:
Interleukin-1 receptor-associated kinase 4
Synonyms:
IRAK-4 IRAK4_HUMAN Interleukin-1 receptor-associated kinase 4 (IRAK4) | Renal carcinoma antigen NY-REN-64
Type:
Protein
Mol. Mass.:
51519.08
Organism:
Homo sapiens (Human)
Description:
Q9NWZ3
Residue:
460
  
Inhibitor
Name:
BDBM355836
Synonyms:
US9815836, Compound 21
Type:
Small organic molecule
Emp. Form.:
C22H24N8O5
Mol. Mass.:
480.4766
SMILES:
Cn1cc2NC(=O)c3cccc(n3)-c3cnn(CCOC(=O)N4CCC(NC(=O)c2n1)C(O)C4)c3
: