Target
Hepatocyte growth factor receptor
Ligand
BDBM355860
Substrate
Meas. Tech.
Kinase Assay
IC50
<40±n/a nM
Citation
 Baik, TGJung, WKim, SIKim, SCPark, SKJung, SYJi, SHKi, SYKim, MCLee, EYHong, EM Protein kinase inhibitor containing pyrrolopyridazine derivative US Patent  US9815840 Publication Date 11/14/2017 
Target
Name:
Hepatocyte growth factor receptor
Synonyms:
Hepatocyte growth factor receptor Hepatocyte growth factor receptor (c-MET) MET Met proto-oncogene (hepatocyte growth factor receptor) Tyrosine-protein kinase Met (c-Met) c-Met kinase
Type:
Protein
Mol. Mass.:
155559.73
Organism:
Homo sapiens (Human)
Description:
P08581
Residue:
1390
  
Inhibitor
Name:
BDBM355860
Synonyms:
4-ethoxy-N-(3-fluoro-4-((5-(3-morpholin-4-carbonylphenyl)pyrrolo[1,2-b]pyridazin-4-yl)oxy)phenyl)-1-(4-fluorophenyl)-2-oxo-1,2-dihydropyridin-3-carboxamide | US9815840, Example 50
Type:
Small organic molecule
Emp. Form.:
C38H31F2N5O6
Mol. Mass.:
691.6794
SMILES:
CCOc1ccn(-c2ccc(F)cc2)c(=O)c1C(=O)Nc1ccc(Oc2ccnn3ccc(-c4cccc(c4)C(=O)N4CCOCC4)c23)c(F)c1
: