Target
Mucosa-associated lymphoid tissue lymphoma translocation protein 1
Ligand
BDBM355888
Substrate
Meas. Tech.
Biochemical Assay
IC50
0.014±n/a nM
Citation
 Soldermann, CPQuancard, JSchlapbach, ASimic, OTintelnot-Blomley, MZoller, T Pyrazolo pyrimidine derivatives and their use as MALT1 inhibitors US Patent  US9815842 Publication Date 11/14/2017 
Target
Name:
Mucosa-associated lymphoid tissue lymphoma translocation protein 1
Synonyms:
MALT lymphoma-associated translocation MALT1 MLT Paracaspase
Type:
Enzyme
Mol. Mass.:
92257.81
Organism:
Homo sapiens (Human)
Description:
Q9UDY8
Residue:
824
  
Inhibitor
Name:
BDBM355888
Synonyms:
(S)-1-(2-chloro-7-(1- methoxyethyl)pyrazo- lo[1,5-a]pyrimidin-6- yl)-3-(2- chloropyridin-4- yl)urea US9815842, Example 12
Type:
Small organic molecule
Emp. Form.:
C15H14Cl2N6O2
Mol. Mass.:
381.217
SMILES:
CO[C@@H](C)c1c(NC(=O)Nc2ccnc(Cl)c2)cnc2cc(Cl)nn12
: