Target
Mucosa-associated lymphoid tissue lymphoma translocation protein 1
Ligand
BDBM355891
Substrate
Meas. Tech.
Biochemical Assay
IC50
0.005±n/a nM
Citation
 Soldermann, CPQuancard, JSchlapbach, ASimic, OTintelnot-Blomley, MZoller, T Pyrazolo pyrimidine derivatives and their use as MALT1 inhibitors US Patent  US9815842 Publication Date 11/14/2017 
Target
Name:
Mucosa-associated lymphoid tissue lymphoma translocation protein 1
Synonyms:
MALT lymphoma-associated translocation MALT1 MLT Paracaspase
Type:
Enzyme
Mol. Mass.:
92257.81
Organism:
Homo sapiens (Human)
Description:
Q9UDY8
Residue:
824
  
Inhibitor
Name:
BDBM355891
Synonyms:
1-(2-chloro-7-(2- methoxypropan-2- yl)pyrazolo[1,5- a]pyrimidin-6-yl)-3- (2- (trifluoromethyl)pyridin- 4-yl)urea US9815842, Example 15
Type:
Small organic molecule
Emp. Form.:
C17H16ClF3N6O2
Mol. Mass.:
428.796
SMILES:
COC(C)(C)c1c(NC(=O)Nc2ccnc(c2)C(F)(F)F)cnc2cc(Cl)nn12
: